Target
Delta-type opioid receptor
Ligand
BDBM75568
Substrate
Meas. Tech.
SAR Analysis of Antagonists of the DOR Receptor using an Image-Based Assay - Set 3
IC50
>32000±n/a nM
Citation
 PubChem, PC SAR Analysis of Antagonists of the DOR Receptor using an Image-Based Assay - Set 3 PubChem Bioassay (2010)[AID] 
Target
Name:
Delta-type opioid receptor
Synonyms:
D-OR-1 Delta opioid receptor OPIATE Delta OPRD1 OPRK1 | opioid receptor, delta 1
Type:
G Protein-Coupled Receptor (GPCR)
Mol. Mass.:
40382.98
Organism:
Homo sapiens (Human)
Description:
Competition binding assays were carried out using membrane preparations from transfected HN9.10 cells that constitutively expressed the delta opioid receptor.
Residue:
372
  
Inhibitor
Name:
BDBM75568
Synonyms:
KSC-11-120-1 N-[2-[(phenylmethyl)-propan-2-yl-amino]ethyl]-4-[[(4-phenylphenyl)sulfonylamino]methyl]benzamide N-[2-[benzyl(isopropyl)amino]ethyl]-4-[[(4-phenylphenyl)sulfonylamino]methyl]benzamide cid_45115592
Type:
Small organic molecule
Emp. Form.:
C32H35N3O3S
Mol. Mass.:
541.704
SMILES:
CC(C)N(CCNC(=O)c1ccc(CNS(=O)(=O)c2ccc(cc2)-c2ccccc2)cc1)Cc1ccccc1
: