Target
Kappa-type opioid receptor
Ligand
BDBM75373
Substrate
Meas. Tech.
SAR analysis of Agonists of the Kappa Opioid Receptor (KOR) using an Image-Based Assay-Set 3
EC50
2350±n/a nM
Citation
 PubChem, PC SAR analysis of Agonists of the Kappa Opioid Receptor (KOR) using an Image-Based Assay-Set 3 PubChem Bioassay (2010)[AID] 
Target
Name:
Kappa-type opioid receptor
Synonyms:
K-OR-1 Kappa-opioid receptor (KOR) Kappa-type opioid receptor (KOR) OPIATE Kappa OPRK1 kappa opioid receptor (KOR)
Type:
G Protein-Coupled Receptor (GPCR)
Mol. Mass.:
42648.76
Organism:
Homo sapiens (Human)
Description:
P41145
Residue:
380
  
Inhibitor
Name:
BDBM75373
Synonyms:
2-[4-(2-furanylmethyl)-5-[(4-nitrophenyl)methylthio]-1,2,4-triazol-3-yl]pyridine 2-[4-(furan-2-ylmethyl)-5-[(4-nitrophenyl)methylsulfanyl]-1,2,4-triazol-3-yl]pyridine KUC104176N | cid_1423675
Type:
Small organic molecule
Emp. Form.:
C19H15N5O3S
Mol. Mass.:
393.419
SMILES:
[O-][N+](=O)c1ccc(CSc2nnc(-c3ccccn3)n2Cc2ccco2)cc1
: