Target
Mu-type opioid receptor
Ligand
BDBM71584
Substrate
Meas. Tech.
SAR Analysis of Antagonists of the MOR Receptor using an Image-Based Assay - Set 3
IC50
>32000±n/a nM
Citation
 PubChem, PC SAR Analysis of Antagonists of the MOR Receptor using an Image-Based Assay - Set 3 PubChem Bioassay (2010)[AID] 
Target
Name:
Mu-type opioid receptor
Synonyms:
M-OR-1 MOR-1 MUOR1 Mu opiate receptor OPRM1 hMOP | mu-type opioid receptor isoform MOR-1
Type:
G Protein-Coupled Receptor (GPCR)
Mol. Mass.:
44789.51
Organism:
Homo sapiens (Human)
Description:
P35372
Residue:
400
  
Inhibitor
Name:
BDBM71584
Synonyms:
KSC-5-281B N-(2-isoindolin-2-ylethyl)-4-[[(4-methoxyphenyl)sulfonylamino]methyl]benzamide cid_44620899
Type:
Small organic molecule
Emp. Form.:
C25H27N3O4S
Mol. Mass.:
465.565
SMILES:
COc1ccc(cc1)S(=O)(=O)NCc1ccc(cc1)C(=O)NCCN1Cc2ccccc2C1
: