Target
Mu-type opioid receptor
Ligand
BDBM71619
Substrate
Meas. Tech.
SAR Analysis of Antagonists of the MOR Receptor using an Image-Based Assay - Set 3
IC50
10300±n/a nM
Citation
 PubChem, PC SAR Analysis of Antagonists of the MOR Receptor using an Image-Based Assay - Set 3 PubChem Bioassay (2010)[AID] 
Target
Name:
Mu-type opioid receptor
Synonyms:
M-OR-1 MOR-1 MUOR1 Mu opiate receptor OPRM1 hMOP | mu-type opioid receptor isoform MOR-1
Type:
G Protein-Coupled Receptor (GPCR)
Mol. Mass.:
44789.51
Organism:
Homo sapiens (Human)
Description:
P35372
Residue:
400
  
Inhibitor
Name:
BDBM71619
Synonyms:
KSC-1-278 cid_45100475
Type:
Small organic molecule
Emp. Form.:
C26H29BrN6O3
Mol. Mass.:
553.451
SMILES:
COc1ccc(cc1)N1CCN(CCCNC(=O)Cn2c3ncc(Br)cc3n3cccc3c2=O)CC1
: