Target
Mu-type opioid receptor
Ligand
BDBM75586
Substrate
Meas. Tech.
SAR Analysis of Antagonists of the MOR Receptor using an Image-Based Assay - Set 3
IC50
>32000±n/a nM
Citation
 PubChem, PC SAR Analysis of Antagonists of the MOR Receptor using an Image-Based Assay - Set 3 PubChem Bioassay (2010)[AID] 
Target
Name:
Mu-type opioid receptor
Synonyms:
M-OR-1 MOR-1 MUOR1 Mu opiate receptor OPRM1 hMOP | mu-type opioid receptor isoform MOR-1
Type:
G Protein-Coupled Receptor (GPCR)
Mol. Mass.:
44789.51
Organism:
Homo sapiens (Human)
Description:
P35372
Residue:
400
  
Inhibitor
Name:
BDBM75586
Synonyms:
KSC-11-152-1 N-[2-(3,4-dihydro-1H-isoquinolin-2-yl)ethyl]-4-[(tosylamino)methyl]benzamide cid_45479161
Type:
Small organic molecule
Emp. Form.:
C26H29N3O3S
Mol. Mass.:
463.592
SMILES:
Cc1ccc(cc1)S(=O)(=O)NCc1ccc(cc1)C(=O)NCCN1CCc2ccccc2C1
: