Target
Caspase-1
Ligand
BDBM33653
Substrate
Meas. Tech.
Dose Response confirmation of inhibitors of NALP1 in yeast using a Caspase-1-ASC counter screen.
IC50
>100000±n/a nM
Citation
 PubChem, PC Dose Response confirmation of inhibitors of NALP1 in yeast using a Caspase-1-ASC counter screen. PubChem Bioassay (2010)[AID] 
Target
Name:
Caspase-1
Synonyms:
CASP1 Caspase ICE IL1BCE Interleukin-1 beta-converting enzyme
Type:
Enzyme
Mol. Mass.:
45154.13
Organism:
Homo sapiens (Human)
Description:
P29466
Residue:
404
  
Inhibitor
Name:
BDBM33653
Synonyms:
1-[3-(4-chlorophenyl)-5-[(4-fluorobenzyl)amino]-1,2,4-triazol-1-yl]-2-methoxy-ethanone 1-[3-(4-chlorophenyl)-5-[(4-fluorophenyl)methylamino]-1,2,4-triazol-1-yl]-2-methoxyethanone MLS000537703 cid_2212071
Type:
Small organic molecule
Emp. Form.:
C18H16ClFN4O2
Mol. Mass.:
374.797
SMILES:
COCC(=O)n1nc(nc1NCc1ccc(F)cc1)-c1ccc(Cl)cc1
: