Target
Caspase-1
Ligand
BDBM76312
Substrate
Meas. Tech.
Dose Response confirmation of inhibitors of NALP1 in yeast using a Caspase-1-ASC counter screen.
IC50
2980±n/a nM
Citation
 PubChem, PC Dose Response confirmation of inhibitors of NALP1 in yeast using a Caspase-1-ASC counter screen. PubChem Bioassay (2010)[AID] 
Target
Name:
Caspase-1
Synonyms:
CASP1 Caspase ICE IL1BCE Interleukin-1 beta-converting enzyme
Type:
Enzyme
Mol. Mass.:
45154.13
Organism:
Homo sapiens (Human)
Description:
P29466
Residue:
404
  
Inhibitor
Name:
BDBM76312
Synonyms:
1-(4-acetylphenyl)-3-(4-chlorophenyl)urea MLS000532184 SMR000137125 | cid_721943
Type:
Small organic molecule
Emp. Form.:
C15H13ClN2O2
Mol. Mass.:
288.729
SMILES:
CC(=O)c1ccc(NC(=O)Nc2ccc(Cl)cc2)cc1
: