Target
Caspase-1
Ligand
BDBM76313
Substrate
Meas. Tech.
Dose Response confirmation of inhibitors of NALP1 in yeast using a Caspase-1-ASC counter screen.
IC50
35800±n/a nM
Citation
 PubChem, PC Dose Response confirmation of inhibitors of NALP1 in yeast using a Caspase-1-ASC counter screen. PubChem Bioassay (2010)[AID] 
Target
Name:
Caspase-1
Synonyms:
CASP1 Caspase ICE IL1BCE Interleukin-1 beta-converting enzyme
Type:
Enzyme
Mol. Mass.:
45154.13
Organism:
Homo sapiens (Human)
Description:
P29466
Residue:
404
  
Inhibitor
Name:
BDBM76313
Synonyms:
4-(2,4-dichlorophenoxy)-N-isopropyl-butyramide 4-(2,4-dichlorophenoxy)-N-propan-2-ylbutanamide MLS000532067 cid_2057520
Type:
Small organic molecule
Emp. Form.:
C13H17Cl2NO2
Mol. Mass.:
290.186
SMILES:
CC(C)NC(=O)CCCOc1ccc(Cl)cc1Cl
: