Target
Caspase-1
Ligand
BDBM66426
Substrate
Meas. Tech.
Dose Response confirmation of inhibitors of NALP1 in yeast using a Caspase-1-ASC counter screen.
IC50
23900±n/a nM
Citation
 PubChem, PC Dose Response confirmation of inhibitors of NALP1 in yeast using a Caspase-1-ASC counter screen. PubChem Bioassay (2010)[AID] 
Target
Name:
Caspase-1
Synonyms:
CASP1 Caspase ICE IL1BCE Interleukin-1 beta-converting enzyme
Type:
Enzyme
Mol. Mass.:
45154.13
Organism:
Homo sapiens (Human)
Description:
P29466
Residue:
404
  
Inhibitor
Name:
BDBM66426
Synonyms:
1-(4,5-dimethyl-2-nitro-phenyl)-3-pyrroline-2,5-quinone 1-(4,5-dimethyl-2-nitrophenyl)-1H-pyrrole-2,5-dione MLS000574749 cid_2912777
Type:
Small organic molecule
Emp. Form.:
C12H10N2O4
Mol. Mass.:
246.2188
SMILES:
Cc1cc(N2C(=O)C=CC2=O)c(cc1C)[N+]([O-])=O
: