Target
Caspase-1
Ligand
BDBM76325
Substrate
Meas. Tech.
Dose Response confirmation of inhibitors of NALP1 in yeast using a Caspase-1-ASC counter screen.
IC50
>100000±n/a nM
Citation
 PubChem, PC Dose Response confirmation of inhibitors of NALP1 in yeast using a Caspase-1-ASC counter screen. PubChem Bioassay (2010)[AID] 
Target
Name:
Caspase-1
Synonyms:
CASP1 Caspase ICE IL1BCE Interleukin-1 beta-converting enzyme
Type:
Enzyme
Mol. Mass.:
45154.13
Organism:
Homo sapiens (Human)
Description:
P29466
Residue:
404
  
Inhibitor
Name:
BDBM76325
Synonyms:
(3Z)-5-(3,4-dimethoxyphenyl)-3-(3-pyridinylmethylidene)-2-furanone (3Z)-5-(3,4-dimethoxyphenyl)-3-(pyridin-3-ylmethylidene)furan-2-one MLS000701093 cid_5407596
Type:
Small organic molecule
Emp. Form.:
C18H15NO4
Mol. Mass.:
309.316
SMILES:
COc1ccc(cc1OC)C1=C\C(=C\c2cccnc2)C(=O)O1
: