Target
Caspase-1
Ligand
BDBM76328
Substrate
Meas. Tech.
Dose Response confirmation of inhibitors of NALP1 in yeast using a Caspase-1-ASC counter screen.
IC50
>100000±n/a nM
Citation
 PubChem, PC Dose Response confirmation of inhibitors of NALP1 in yeast using a Caspase-1-ASC counter screen. PubChem Bioassay (2010)[AID] 
Target
Name:
Caspase-1
Synonyms:
CASP1 Caspase ICE IL1BCE Interleukin-1 beta-converting enzyme
Type:
Enzyme
Mol. Mass.:
45154.13
Organism:
Homo sapiens (Human)
Description:
P29466
Residue:
404
  
Inhibitor
Name:
BDBM76328
Synonyms:
MLS000681264 N-(2-methoxy-5-methyl-phenyl)-4-[(4-phenylpiperazino)methyl]benzamide N-(2-methoxy-5-methylphenyl)-4-[(4-phenylpiperazin-1-yl)methyl]benzamide cid_2897124
Type:
Small organic molecule
Emp. Form.:
C26H29N3O2
Mol. Mass.:
415.5274
SMILES:
COc1ccc(C)cc1NC(=O)c1ccc(CN2CCN(CC2)c2ccccc2)cc1
: