Target
Type-1 angiotensin II receptor
Ligand
BDBM76099
Substrate
Meas. Tech.
Dose Response screen for agonists of Angiotensin II Receptor Type 1 to assess selectivity of uHTS small molecule agonists hits of the APJ receptor
EC50
>100000±n/a nM
Citation
 PubChem, PC Dose Response screen for agonists of Angiotensin II Receptor Type 1 to assess selectivity of uHTS small molecule agonists hits of the APJ receptor PubChem Bioassay (2010)[AID] 
Target
Name:
Type-1 angiotensin II receptor
Synonyms:
AGTR1 AGTR1B AT1 AT1BR AT2R1B Angiotensin II receptor Type-1 angiotensin II receptor (AT1)
Type:
Protein
Mol. Mass.:
41080.75
Organism:
Homo sapiens (Human)
Description:
P30556
Residue:
359
  
Inhibitor
Name:
BDBM76099
Synonyms:
3-[3,4-dihydro-1H-isoquinolin-2-yl-[1-(2-oxolanylmethyl)-5-tetrazolyl]methyl]-6-methoxy-1H-quinolin-2-one 3-[3,4-dihydro-1H-isoquinolin-2-yl-[1-(oxolan-2-ylmethyl)tetrazol-5-yl]methyl]-6-methoxy-1H-quinolin-2-one 3-{(3,4-Dihydro-1H-isoquinolin-2-yl)-[1-(tetrahydro-furan-2-ylmethyl)-1H-tetrazol-5-yl]-methyl}-6-methoxy-1H-quinolin-2-one SMR000002497 | cid_646383
Type:
Small organic molecule
Emp. Form.:
C26H28N6O3
Mol. Mass.:
472.5389
SMILES:
COc1ccc2[nH]c(=O)c(cc2c1)C(N1CCc2ccccc2C1)c1nnnn1CC1CCCO1
: