Target
Type-1 angiotensin II receptor
Ligand
BDBM76124
Substrate
Meas. Tech.
Dose Response screen for agonists of Angiotensin II Receptor Type 1 to assess selectivity of uHTS small molecule agonists hits of the APJ receptor
EC50
>100000±n/a nM
Citation
 PubChem, PC Dose Response screen for agonists of Angiotensin II Receptor Type 1 to assess selectivity of uHTS small molecule agonists hits of the APJ receptor PubChem Bioassay (2010)[AID] 
Target
Name:
Type-1 angiotensin II receptor
Synonyms:
AGTR1 AGTR1B AT1 AT1BR AT2R1B Angiotensin II receptor Type-1 angiotensin II receptor (AT1)
Type:
Protein
Mol. Mass.:
41080.75
Organism:
Homo sapiens (Human)
Description:
P30556
Residue:
359
  
Inhibitor
Name:
BDBM76124
Synonyms:
MLS000672050 N-[4-(4-isobutyrylpiperazino)phenyl]-2-(2-nitrophenoxy)acetamide N-[4-[4-(2-methylpropanoyl)piperazin-1-yl]phenyl]-2-(2-nitrophenoxy)acetamide SMR000293475 | cid_2949699
Type:
Small organic molecule
Emp. Form.:
C22H26N4O5
Mol. Mass.:
426.4656
SMILES:
CC(C)C(=O)N1CCN(CC1)c1ccc(NC(=O)COc2ccccc2[N+]([O-])=O)cc1
: