Target
Type-1 angiotensin II receptor
Ligand
BDBM76127
Substrate
Meas. Tech.
Dose Response screen for agonists of Angiotensin II Receptor Type 1 to assess selectivity of uHTS small molecule agonists hits of the APJ receptor
EC50
>100000±n/a nM
Citation
 PubChem, PC Dose Response screen for agonists of Angiotensin II Receptor Type 1 to assess selectivity of uHTS small molecule agonists hits of the APJ receptor PubChem Bioassay (2010)[AID] 
Target
Name:
Type-1 angiotensin II receptor
Synonyms:
AGTR1 AGTR1B AT1 AT1BR AT2R1B Angiotensin II receptor Type-1 angiotensin II receptor (AT1)
Type:
Protein
Mol. Mass.:
41080.75
Organism:
Homo sapiens (Human)
Description:
P30556
Residue:
359
  
Inhibitor
Name:
BDBM76127
Synonyms:
2-thiophenecarboxylic acid [2-cyclohexyl-3-(4-methoxy-4-oxobutyl)-7-methyl-6,8-dioxo-7-isoquinolinyl] ester MLS000438638 [2-cyclohexyl-3-(4-methoxy-4-oxidanylidene-butyl)-7-methyl-6,8-bis(oxidanylidene)isoquinolin-7-yl] thiophene-2-carboxylate cid_16745587 | thiophene-2-carboxylic acid [2-cyclohexyl-6,8-diketo-3-(4-keto-4-methoxy-butyl)-7-methyl-7-isoquinolyl] ester
Type:
Small organic molecule
Emp. Form.:
C26H29NO6S
Mol. Mass.:
483.577
SMILES:
COC(=O)CCCC1=CC2=CC(=O)C(C)(OC(=O)c3cccs3)C(=O)C2=CN1C1CCCCC1
: