Target
Type-1 angiotensin II receptor
Ligand
BDBM76131
Substrate
Meas. Tech.
Dose Response screen for agonists of Angiotensin II Receptor Type 1 to assess selectivity of uHTS small molecule agonists hits of the APJ receptor
EC50
>100000±n/a nM
Citation
 PubChem, PC Dose Response screen for agonists of Angiotensin II Receptor Type 1 to assess selectivity of uHTS small molecule agonists hits of the APJ receptor PubChem Bioassay (2010)[AID] 
Target
Name:
Type-1 angiotensin II receptor
Synonyms:
AGTR1 AGTR1B AT1 AT1BR AT2R1B Angiotensin II receptor Type-1 angiotensin II receptor (AT1)
Type:
Protein
Mol. Mass.:
41080.75
Organism:
Homo sapiens (Human)
Description:
P30556
Residue:
359
  
Inhibitor
Name:
BDBM76131
Synonyms:
2-(3-chlorobenzyl)-1,3,4,9-tetrahydro-beta-carboline 2-[(3-chlorophenyl)methyl]-1,3,4,9-tetrahydropyrido[3,4-b]indole SMR000496089 | cid_766064
Type:
Small organic molecule
Emp. Form.:
C18H17ClN2
Mol. Mass.:
296.794
SMILES:
Clc1cccc(CN2CCc3c(C2)[nH]c2ccccc32)c1
: