Target
Type-1 angiotensin II receptor
Ligand
BDBM76138
Substrate
Meas. Tech.
Dose Response screen for agonists of Angiotensin II Receptor Type 1 to assess selectivity of uHTS small molecule agonists hits of the APJ receptor
EC50
>100000±n/a nM
Citation
 PubChem, PC Dose Response screen for agonists of Angiotensin II Receptor Type 1 to assess selectivity of uHTS small molecule agonists hits of the APJ receptor PubChem Bioassay (2010)[AID] 
Target
Name:
Type-1 angiotensin II receptor
Synonyms:
AGTR1 AGTR1B AT1 AT1BR AT2R1B Angiotensin II receptor Type-1 angiotensin II receptor (AT1)
Type:
Protein
Mol. Mass.:
41080.75
Organism:
Homo sapiens (Human)
Description:
P30556
Residue:
359
  
Inhibitor
Name:
BDBM76138
Synonyms:
2-(4-keto-2H-pyridazin[4,5-b]indol-3-yl)-N-[4-(piperidinomethyl)phenyl]acetamide 2-(4-oxo-2H-pyridazino[4,5-b]indol-3-yl)-N-[4-(1-piperidinylmethyl)phenyl]acetamide MLS001126438 cid_20913048
Type:
Small organic molecule
Emp. Form.:
C24H25N5O2
Mol. Mass.:
415.4876
SMILES:
O=C(Cn1ncc2c3ccccc3[nH]c2c1=O)Nc1ccc(CN2CCCCC2)cc1
: