Target
Type-1 angiotensin II receptor
Ligand
BDBM66944
Substrate
Meas. Tech.
Dose Response screen for agonists of Angiotensin II Receptor Type 1 to assess selectivity of uHTS small molecule agonists hits of the APJ receptor
EC50
>100000±n/a nM
Citation
 PubChem, PC Dose Response screen for agonists of Angiotensin II Receptor Type 1 to assess selectivity of uHTS small molecule agonists hits of the APJ receptor PubChem Bioassay (2010)[AID] 
Target
Name:
Type-1 angiotensin II receptor
Synonyms:
AGTR1 AGTR1B AT1 AT1BR AT2R1B Angiotensin II receptor Type-1 angiotensin II receptor (AT1)
Type:
Protein
Mol. Mass.:
41080.75
Organism:
Homo sapiens (Human)
Description:
P30556
Residue:
359
  
Inhibitor
Name:
BDBM66944
Synonyms:
MLS001239376 N-(6,7-dihydro-[1,4]dioxino[2,3-f][1,3]benzothiazol-2-yl)-N-[3-(dimethylamino)propyl]-5-nitro-benzothiophene-2-carboxamide;hydrochloride cid_24892073
Type:
Small organic molecule
Emp. Form.:
C23H22N4O5S2
Mol. Mass.:
498.575
SMILES:
CN(C)CCCN(C(=O)c1cc2cc(ccc2s1)[N+]([O-])=O)c1nc2cc3OCCOc3cc2s1
: