Target
Intestinal-type alkaline phosphatase
Ligand
BDBM76154
Substrate
Meas. Tech.
Dose Response confirmation of uHTS activators of Mouse Intestinal Alkaline Phosphatase using Human Intestinal Alkaline Phosphatase
EC50
68000±n/a nM
Citation
 PubChem, PC Dose Response confirmation of uHTS activators of Mouse Intestinal Alkaline Phosphatase using Human Intestinal Alkaline Phosphatase PubChem Bioassay (2010)[AID] 
Target
Name:
Intestinal-type alkaline phosphatase
Synonyms:
ALPI Intestinal alkaline phosphatase | PPBI_HUMAN
Type:
PROTEIN
Mol. Mass.:
56804.94
Organism:
Homo sapiens (Human)
Description:
ChEMBL_1278525
Residue:
528
  
Inhibitor
Name:
BDBM76154
Synonyms:
(5Z)-5-[(2,5-dimethyl-1H-pyrrol-3-yl)methylene]-2-thioxo-thiazolidin-4-one (5Z)-5-[(2,5-dimethyl-1H-pyrrol-3-yl)methylidene]-2-sulfanylidene-4-thiazolidinone MLS000756254 cid_1206896
Type:
Small organic molecule
Emp. Form.:
C10H10N2OS2
Mol. Mass.:
238.329
SMILES:
Cc1cc(C=C2SC(S)=NC2=O)c(C)[nH]1
: