Target
Intestinal-type alkaline phosphatase
Ligand
BDBM50704
Substrate
Meas. Tech.
Dose Response confirmation of uHTS activators of Mouse Intestinal Alkaline Phosphatase using Human Intestinal Alkaline Phosphatase
EC50
96300±n/a nM
Citation
 PubChem, PC Dose Response confirmation of uHTS activators of Mouse Intestinal Alkaline Phosphatase using Human Intestinal Alkaline Phosphatase PubChem Bioassay (2010)[AID] 
Target
Name:
Intestinal-type alkaline phosphatase
Synonyms:
ALPI Intestinal alkaline phosphatase | PPBI_HUMAN
Type:
PROTEIN
Mol. Mass.:
56804.94
Organism:
Homo sapiens (Human)
Description:
ChEMBL_1278525
Residue:
528
  
Inhibitor
Name:
BDBM50704
Synonyms:
5-[1-(3-Chloro-propyl)-2,3-dihydro-1H-indol-5-ylmethylene]-2-thioxo-dihydro-pyrimidine-4,6-dione 5-[[1-(3-chloropropyl)-2,3-dihydroindol-5-yl]methylidene]-2-sulfanylidene-1,3-diazinane-4,6-dione MLS000333298 cid_1629947
Type:
Small organic molecule
Emp. Form.:
C16H16ClN3O2S
Mol. Mass.:
349.835
SMILES:
Cl[#6]-[#6]-[#6]-[#7]-1-[#6]-[#6]-c2cc(\[#6]=[#6]-3/[#6](=O)-[#7]-[#6](=S)-[#7]-[#6]-3=O)ccc-12
: