Target
Intestinal-type alkaline phosphatase
Ligand
BDBM53069
Substrate
Meas. Tech.
Dose Response confirmation of uHTS activators of Mouse Intestinal Alkaline Phosphatase using Human Intestinal Alkaline Phosphatase
EC50
48700±n/a nM
Citation
 PubChem, PC Dose Response confirmation of uHTS activators of Mouse Intestinal Alkaline Phosphatase using Human Intestinal Alkaline Phosphatase PubChem Bioassay (2010)[AID] 
Target
Name:
Intestinal-type alkaline phosphatase
Synonyms:
ALPI Intestinal alkaline phosphatase | PPBI_HUMAN
Type:
PROTEIN
Mol. Mass.:
56804.94
Organism:
Homo sapiens (Human)
Description:
ChEMBL_1278525
Residue:
528
  
Inhibitor
Name:
BDBM53069
Synonyms:
4-[2-(2-pyridinylamino)-4-thiazolyl]benzene-1,2-diol 4-[2-(Pyridin-2-ylamino)-thiazol-4-yl]-benzene-1,2-diol MLS001209091 cid_434633
Type:
Small organic molecule
Emp. Form.:
C14H11N3O2S
Mol. Mass.:
285.321
SMILES:
Oc1ccc(cc1O)-c1csc(Nc2ccccn2)n1
: