Target
Intestinal-type alkaline phosphatase
Ligand
BDBM60895
Substrate
Meas. Tech.
Dose Response confirmation of uHTS activators of Mouse Intestinal Alkaline Phosphatase using Human Intestinal Alkaline Phosphatase
EC50
66200±n/a nM
Citation
 PubChem, PC Dose Response confirmation of uHTS activators of Mouse Intestinal Alkaline Phosphatase using Human Intestinal Alkaline Phosphatase PubChem Bioassay (2010)[AID] 
Target
Name:
Intestinal-type alkaline phosphatase
Synonyms:
ALPI Intestinal alkaline phosphatase | PPBI_HUMAN
Type:
PROTEIN
Mol. Mass.:
56804.94
Organism:
Homo sapiens (Human)
Description:
ChEMBL_1278525
Residue:
528
  
Inhibitor
Name:
BDBM60895
Synonyms:
4-[3-[(5Z)-5-(2-furfurylidene)-4-keto-2-thioxo-thiazolidin-3-yl]propanoylamino]-2-hydroxy-benzoic acid 4-[3-[(5Z)-5-(furan-2-ylmethylidene)-4-oxo-2-sulfanylidene-1,3-thiazolidin-3-yl]propanoylamino]-2-hydroxybenzoic acid MLS001216242 cid_6014081
Type:
Small organic molecule
Emp. Form.:
C18H14N2O6S2
Mol. Mass.:
418.444
SMILES:
OC(=O)c1ccc(NC(=O)CCN2C(=S)S\C(=C/c3ccco3)C2=O)cc1O
: