Target
Intestinal-type alkaline phosphatase
Ligand
BDBM76206
Substrate
Meas. Tech.
Dose Response confirmation of uHTS activators of Mouse Intestinal Alkaline Phosphatase using Human Intestinal Alkaline Phosphatase
EC50
>100000±n/a nM
Citation
 PubChem, PC Dose Response confirmation of uHTS activators of Mouse Intestinal Alkaline Phosphatase using Human Intestinal Alkaline Phosphatase PubChem Bioassay (2010)[AID] 
Target
Name:
Intestinal-type alkaline phosphatase
Synonyms:
ALPI Intestinal alkaline phosphatase | PPBI_HUMAN
Type:
PROTEIN
Mol. Mass.:
56804.94
Organism:
Homo sapiens (Human)
Description:
ChEMBL_1278525
Residue:
528
  
Inhibitor
Name:
BDBM76206
Synonyms:
1-(3,4-dihydroxyphenyl)-2-[4-(2-fluorophenyl)-1-piperazinyl]ethanone 1-(3,4-dihydroxyphenyl)-2-[4-(2-fluorophenyl)piperazino]ethanone MLS001202427 cid_4122157
Type:
Small organic molecule
Emp. Form.:
C18H19FN2O3
Mol. Mass.:
330.3535
SMILES:
Oc1ccc(cc1O)C(=O)CN1CCN(CC1)c1ccccc1F
: