Target
Intestinal-type alkaline phosphatase
Ligand
BDBM76160
Substrate
Meas. Tech.
Dose Response confirmation of uHTS activators of Mouse Intestinal Alkaline Phosphatase using Human Intestinal Alkaline Phosphatase
EC50
42800±n/a nM
Citation
 PubChem, PC Dose Response confirmation of uHTS activators of Mouse Intestinal Alkaline Phosphatase using Human Intestinal Alkaline Phosphatase PubChem Bioassay (2010)[AID] 
Target
Name:
Intestinal-type alkaline phosphatase
Synonyms:
ALPI Intestinal alkaline phosphatase | PPBI_HUMAN
Type:
PROTEIN
Mol. Mass.:
56804.94
Organism:
Homo sapiens (Human)
Description:
ChEMBL_1278525
Residue:
528
  
Inhibitor
Name:
BDBM76160
Synonyms:
MLS001096135 N-(3-chloro-4-methoxy-phenyl)-3-[(2-keto-3H-1,3-benzoxazol-6-yl)sulfonylamino]propionamide SMR000631053 | cid_24790993
Type:
Small organic molecule
Emp. Form.:
C17H16ClN3O6S
Mol. Mass.:
425.843
SMILES:
COc1ccc(NC(=O)CCNS(=O)(=O)c2ccc3[nH]c(=O)oc3c2)cc1Cl
: