Target
Intestinal-type alkaline phosphatase 1
Ligand
BDBM62366
Substrate
Meas. Tech.
Dose Response confirmation of uHTS inhibitors of Human Intestinal Alkaline Phosphatase using Mouse Intestinal Alkaline Phosphatase
IC50
>100000±n/a nM
Citation
 PubChem, PC Dose Response confirmation of uHTS inhibitors of Human Intestinal Alkaline Phosphatase using Mouse Intestinal Alkaline Phosphatase PubChem Bioassay (2010)[AID] 
Target
Name:
Intestinal-type alkaline phosphatase 1
Synonyms:
Alpi | PPBI1_RAT
Type:
Enzyme Catalytic Domain
Mol. Mass.:
58396.39
Organism:
Rattus norvegicus (Rat)
Description:
P15693
Residue:
540
  
Inhibitor
Name:
BDBM62366
Synonyms:
2-[(4-bromo-2-methyl-phenyl)thio]acetic acid [3-cyano-3-(1,3-dihydrobenzimidazol-2-ylidene)-2-keto-propyl] ester MLS-0392851.0001 [3-cyano-3-(1,3-dihydrobenzimidazol-2-ylidene)-2-oxopropyl] 2-(4-bromo-2-methylphenyl)sulfanylacetate | cid_5679900
Type:
Small organic molecule
Emp. Form.:
C20H16BrN3O3S
Mol. Mass.:
458.328
SMILES:
Cc1cc(Br)ccc1SCC(=O)OCC(=O)C(C#N)c1nc2ccccc2[nH]1
: