Target
Intestinal-type alkaline phosphatase 1
Ligand
BDBM75634
Substrate
Meas. Tech.
Dose Response confirmation of uHTS inhibitors of Human Intestinal Alkaline Phosphatase using Mouse Intestinal Alkaline Phosphatase
IC50
42200±n/a nM
Citation
 PubChem, PC Dose Response confirmation of uHTS inhibitors of Human Intestinal Alkaline Phosphatase using Mouse Intestinal Alkaline Phosphatase PubChem Bioassay (2010)[AID] 
Target
Name:
Intestinal-type alkaline phosphatase 1
Synonyms:
Alpi | PPBI1_RAT
Type:
Enzyme Catalytic Domain
Mol. Mass.:
58396.39
Organism:
Rattus norvegicus (Rat)
Description:
P15693
Residue:
540
  
Inhibitor
Name:
BDBM75634
Synonyms:
2-(8-amino-9H-[1,2,4]triazolo[1,5-d][1,2,4]triazepin-5-yl)-5-(2-methoxyphenyl)-3-(trifluoromethyl)-2-pyrazolin-3-ol 2-(8-azanyl-9H-[1,2,4]triazolo[1,5-d][1,2,4]triazepin-5-yl)-5-(2-methoxyphenyl)-3-(trifluoromethyl)-4H-pyrazol-3-ol SMR000287148 | cid_5103621
Type:
Small organic molecule
Emp. Form.:
C16H15F3N8O2
Mol. Mass.:
408.3379
SMILES:
COc1ccccc1C1=NN(C2=NN=C(N)Cc3ncnn23)C(O)(C1)C(F)(F)F
: