Target
Intestinal-type alkaline phosphatase 1
Ligand
BDBM61326
Substrate
Meas. Tech.
Dose Response confirmation of uHTS inhibitors of Human Intestinal Alkaline Phosphatase using Mouse Intestinal Alkaline Phosphatase
IC50
5040±n/a nM
Citation
 PubChem, PC Dose Response confirmation of uHTS inhibitors of Human Intestinal Alkaline Phosphatase using Mouse Intestinal Alkaline Phosphatase PubChem Bioassay (2010)[AID] 
Target
Name:
Intestinal-type alkaline phosphatase 1
Synonyms:
Alpi | PPBI1_RAT
Type:
Enzyme Catalytic Domain
Mol. Mass.:
58396.39
Organism:
Rattus norvegicus (Rat)
Description:
P15693
Residue:
540
  
Inhibitor
Name:
BDBM61326
Synonyms:
1-N',2-N'-bis[(E)-(2-hydroxy-4-oxocyclohexa-2,5-dien-1-ylidene)methyl]ethanedihydrazide N'~1~,N'~2~-bis(2,4-dihydroxybenzylidene)ethanedihydrazide N1',N2'-bis[(E)-(2-hydroxy-4-oxo-1-cyclohexa-2,5-dienylidene)methyl]ethanedihydrazide SMR000496526 | cid_6508451
Type:
Small organic molecule
Emp. Form.:
C16H14N4O6
Mol. Mass.:
358.3056
SMILES:
Oc1ccc(C=NNC(=O)C(=O)NN=Cc2ccc(O)cc2O)c(O)c1
: