Target
Intestinal-type alkaline phosphatase 1
Ligand
BDBM75696
Substrate
Meas. Tech.
Dose Response confirmation of uHTS inhibitors of Human Intestinal Alkaline Phosphatase using Mouse Intestinal Alkaline Phosphatase
IC50
34200±n/a nM
Citation
 PubChem, PC Dose Response confirmation of uHTS inhibitors of Human Intestinal Alkaline Phosphatase using Mouse Intestinal Alkaline Phosphatase PubChem Bioassay (2010)[AID] 
Target
Name:
Intestinal-type alkaline phosphatase 1
Synonyms:
Alpi | PPBI1_RAT
Type:
Enzyme Catalytic Domain
Mol. Mass.:
58396.39
Organism:
Rattus norvegicus (Rat)
Description:
P15693
Residue:
540
  
Inhibitor
Name:
BDBM75696
Synonyms:
1-[3-(dimethylsulfamoyl)phenyl]-3-[(3-hydroxy-2-naphthoyl)amino]thiourea 1-[3-(dimethylsulfamoyl)phenyl]-3-[(3-oxidanylnaphthalen-2-yl)carbonylamino]thiourea MLS002166483 cid_4848262
Type:
Small organic molecule
Emp. Form.:
C20H20N4O4S2
Mol. Mass.:
444.527
SMILES:
CN(C)S(=O)(=O)c1cccc(NC(=S)NNC(=O)c2cc3ccccc3cc2O)c1
: