Target
Intestinal-type alkaline phosphatase 1
Ligand
BDBM75703
Substrate
Meas. Tech.
Dose Response confirmation of uHTS inhibitors of Human Intestinal Alkaline Phosphatase using Mouse Intestinal Alkaline Phosphatase
IC50
47200±n/a nM
Citation
 PubChem, PC Dose Response confirmation of uHTS inhibitors of Human Intestinal Alkaline Phosphatase using Mouse Intestinal Alkaline Phosphatase PubChem Bioassay (2010)[AID] 
Target
Name:
Intestinal-type alkaline phosphatase 1
Synonyms:
Alpi | PPBI1_RAT
Type:
Enzyme Catalytic Domain
Mol. Mass.:
58396.39
Organism:
Rattus norvegicus (Rat)
Description:
P15693
Residue:
540
  
Inhibitor
Name:
BDBM75703
Synonyms:
4-[[4-(isoxazol-3-ylcarbamoyl)-1H-imidazole-5-carbonyl]amino]piperidine-1-carboxylic acid tert-butyl ester MLS002206716 cid_42628369 tert-butyl 4-[[4-(1,2-oxazol-3-ylcarbamoyl)-1H-imidazole-5-carbonyl]amino]piperidine-1-carboxylate
Type:
Small organic molecule
Emp. Form.:
C18H24N6O5
Mol. Mass.:
404.4204
SMILES:
CC(C)(C)OC(=O)N1CCC(CC1)NC(=O)c1nc[nH]c1C(=O)Nc1ccon1
: