Target
Intestinal-type alkaline phosphatase 1
Ligand
BDBM75663
Substrate
Meas. Tech.
Dose Response confirmation of uHTS activators of Human Intestinal Alkaline Phosphatase using Mouse Intestinal Alkaline Phosphatase
EC50
61000±n/a nM
Citation
 PubChem, PC Dose Response confirmation of uHTS activators of Human Intestinal Alkaline Phosphatase using Mouse Intestinal Alkaline Phosphatase PubChem Bioassay (2010)[AID] 
Target
Name:
Intestinal-type alkaline phosphatase 1
Synonyms:
Alpi | PPBI1_RAT
Type:
Enzyme Catalytic Domain
Mol. Mass.:
58396.39
Organism:
Rattus norvegicus (Rat)
Description:
P15693
Residue:
540
  
Inhibitor
Name:
BDBM75663
Synonyms:
MLS001072359 N-[2-[1-[(2-methylphenyl)methyl]-4-piperidinyl]-3-pyrazolyl]-4-phenylbutanamide N-[2-[1-[(2-methylphenyl)methyl]piperidin-4-yl]pyrazol-3-yl]-4-phenylbutanamide cid_24790158
Type:
Small organic molecule
Emp. Form.:
C26H32N4O
Mol. Mass.:
416.5585
SMILES:
Cc1ccccc1CN1CCC(CC1)n1nccc1NC(=O)CCCc1ccccc1
: