Target
Intestinal-type alkaline phosphatase 1
Ligand
BDBM75665
Substrate
Meas. Tech.
Dose Response confirmation of uHTS activators of Human Intestinal Alkaline Phosphatase using Mouse Intestinal Alkaline Phosphatase
EC50
80600±n/a nM
Citation
 PubChem, PC Dose Response confirmation of uHTS activators of Human Intestinal Alkaline Phosphatase using Mouse Intestinal Alkaline Phosphatase PubChem Bioassay (2010)[AID] 
Target
Name:
Intestinal-type alkaline phosphatase 1
Synonyms:
Alpi | PPBI1_RAT
Type:
Enzyme Catalytic Domain
Mol. Mass.:
58396.39
Organism:
Rattus norvegicus (Rat)
Description:
P15693
Residue:
540
  
Inhibitor
Name:
BDBM75665
Synonyms:
MLS001101286 N-[2-[1-[(2-ethoxyphenyl)methyl]-4-piperidinyl]-3-pyrazolyl]-3-phenylpropanamide N-[2-[1-[(2-ethoxyphenyl)methyl]piperidin-4-yl]pyrazol-3-yl]-3-phenylpropanamide cid_24791181
Type:
Small organic molecule
Emp. Form.:
C26H32N4O2
Mol. Mass.:
432.5579
SMILES:
CCOc1ccccc1CN1CCC(CC1)n1nccc1NC(=O)CCc1ccccc1
: