Target
Intestinal-type alkaline phosphatase
Ligand
BDBM76169
Substrate
Meas. Tech.
Dose Response confirmation of uHTS inhibitors of Mouse Intestinal Alkaline Phosphatase using Human Intestinal Alkaline Phosphatase
IC50
5040±n/a nM
Citation
 PubChem, PC Dose Response confirmation of uHTS inhibitors of Mouse Intestinal Alkaline Phosphatase using Human Intestinal Alkaline Phosphatase PubChem Bioassay (2010)[AID] 
Target
Name:
Intestinal-type alkaline phosphatase
Synonyms:
ALPI Intestinal alkaline phosphatase | PPBI_HUMAN
Type:
PROTEIN
Mol. Mass.:
56804.94
Organism:
Homo sapiens (Human)
Description:
ChEMBL_1278525
Residue:
528
  
Inhibitor
Name:
BDBM76169
Synonyms:
4-ethoxy-N-[4-hydroxy-3-(1H-1,2,4-triazol-3-ylsulfanyl)phenyl]benzenesulfonamide 4-ethoxy-N-[4-hydroxy-3-(1H-1,2,4-triazol-5-ylthio)phenyl]benzenesulfonamide MLS000549575 cid_7312244
Type:
Small organic molecule
Emp. Form.:
C16H16N4O4S2
Mol. Mass.:
392.453
SMILES:
CCOc1ccc(cc1)S(=O)(=O)Nc1ccc(O)c(Sc2nnc[nH]2)c1
: