Target
Intestinal-type alkaline phosphatase
Ligand
BDBM76173
Substrate
Meas. Tech.
Dose Response confirmation of uHTS inhibitors of Mouse Intestinal Alkaline Phosphatase using Human Intestinal Alkaline Phosphatase
IC50
4060±n/a nM
Citation
 PubChem, PC Dose Response confirmation of uHTS inhibitors of Mouse Intestinal Alkaline Phosphatase using Human Intestinal Alkaline Phosphatase PubChem Bioassay (2010)[AID] 
Target
Name:
Intestinal-type alkaline phosphatase
Synonyms:
ALPI Intestinal alkaline phosphatase | PPBI_HUMAN
Type:
PROTEIN
Mol. Mass.:
56804.94
Organism:
Homo sapiens (Human)
Description:
ChEMBL_1278525
Residue:
528
  
Inhibitor
Name:
BDBM76173
Synonyms:
1-(3,5-Dimethyl-phenyl)-3-(9-thiophen-2-ylmethyl-9-aza-bicyclo[3.3.1]non-3-yl)-thiourea 1-(3,5-dimethylphenyl)-3-[9-(thiophen-2-ylmethyl)-9-azabicyclo[3.3.1]nonan-3-yl]thiourea SMR000173334 | cid_3218185
Type:
Small organic molecule
Emp. Form.:
C22H29N3S2
Mol. Mass.:
399.616
SMILES:
[H]C12CCCC([H])(CC(C1)NC(=S)Nc1cc(C)cc(C)c1)N2Cc1cccs1
: