Target
Intestinal-type alkaline phosphatase
Ligand
BDBM59317
Substrate
Meas. Tech.
Dose Response confirmation of uHTS inhibitors of Mouse Intestinal Alkaline Phosphatase using Human Intestinal Alkaline Phosphatase
IC50
>100000±n/a nM
Citation
 PubChem, PC Dose Response confirmation of uHTS inhibitors of Mouse Intestinal Alkaline Phosphatase using Human Intestinal Alkaline Phosphatase PubChem Bioassay (2010)[AID] 
Target
Name:
Intestinal-type alkaline phosphatase
Synonyms:
ALPI Intestinal alkaline phosphatase | PPBI_HUMAN
Type:
PROTEIN
Mol. Mass.:
56804.94
Organism:
Homo sapiens (Human)
Description:
ChEMBL_1278525
Residue:
528
  
Inhibitor
Name:
BDBM59317
Synonyms:
1-[9-[(4-methylphenyl)methyl]-9-azabicyclo[3.3.1]nonan-3-yl]-3-(phenylmethyl)thiourea 1-benzyl-3-[9-[(4-methylphenyl)methyl]-9-azabicyclo[3.3.1]nonan-3-yl]thiourea SMR000286270 | cid_3218135
Type:
Small organic molecule
Emp. Form.:
C24H31N3S
Mol. Mass.:
393.588
SMILES:
[H]C12CCCC([H])(CC(C1)NC(=S)NCc1ccccc1)N2Cc1ccc(C)cc1
: