Target
Intestinal-type alkaline phosphatase
Ligand
BDBM61305
Substrate
Meas. Tech.
Dose Response confirmation of uHTS inhibitors of Mouse Intestinal Alkaline Phosphatase using Human Intestinal Alkaline Phosphatase
IC50
>100000±n/a nM
Citation
 PubChem, PC Dose Response confirmation of uHTS inhibitors of Mouse Intestinal Alkaline Phosphatase using Human Intestinal Alkaline Phosphatase PubChem Bioassay (2010)[AID] 
Target
Name:
Intestinal-type alkaline phosphatase
Synonyms:
ALPI Intestinal alkaline phosphatase | PPBI_HUMAN
Type:
PROTEIN
Mol. Mass.:
56804.94
Organism:
Homo sapiens (Human)
Description:
ChEMBL_1278525
Residue:
528
  
Inhibitor
Name:
BDBM61305
Synonyms:
5,7-dimethoxy-8-oxidanyl-2-phenyl-2,3-dihydrochromen-4-one 8-hydroxy-5,7-dimethoxy-2-phenyl-3,4-dihydro-2H-1-benzopyran-4-one MLS000877012 cid_16196978
Type:
Small organic molecule
Emp. Form.:
C17H16O5
Mol. Mass.:
300.3059
SMILES:
COc1cc(OC)c2C(=O)CC(Oc2c1O)c1ccccc1
: