Target
Intestinal-type alkaline phosphatase
Ligand
BDBM76193
Substrate
Meas. Tech.
Dose Response confirmation of uHTS inhibitors of Mouse Intestinal Alkaline Phosphatase using Human Intestinal Alkaline Phosphatase
IC50
1740±n/a nM
Citation
 PubChem, PC Dose Response confirmation of uHTS inhibitors of Mouse Intestinal Alkaline Phosphatase using Human Intestinal Alkaline Phosphatase PubChem Bioassay (2010)[AID] 
Target
Name:
Intestinal-type alkaline phosphatase
Synonyms:
ALPI Intestinal alkaline phosphatase | PPBI_HUMAN
Type:
PROTEIN
Mol. Mass.:
56804.94
Organism:
Homo sapiens (Human)
Description:
ChEMBL_1278525
Residue:
528
  
Inhibitor
Name:
BDBM76193
Synonyms:
(2Z)-2-[2-[2-(3-methoxy-3-oxidanylidene-propylidene)hydrazinyl]-4-oxidanylidene-1,3-thiazol-5-ylidene]ethanoic acid (2Z)-2-[2-[2-(3-methoxy-3-oxopropylidene)hydrazinyl]-4-oxo-5-thiazolylidene]acetic acid 3-({5-[1-Carboxy-meth-(Z)-ylidene]-4-oxo-4,5-dihydro-thiazol-2-yl}-hydrazono)-propionic acid methyl ester SMR000413875 | cid_16682271
Type:
Small organic molecule
Emp. Form.:
C9H9N3O5S
Mol. Mass.:
271.25
SMILES:
COC(=O)CC=NNC1=NC(=O)C(S1)=CC(O)=O
: