Target
Intestinal-type alkaline phosphatase
Ligand
BDBM76197
Substrate
Meas. Tech.
Dose Response confirmation of uHTS inhibitors of Mouse Intestinal Alkaline Phosphatase using Human Intestinal Alkaline Phosphatase
IC50
>100000±n/a nM
Citation
 PubChem, PC Dose Response confirmation of uHTS inhibitors of Mouse Intestinal Alkaline Phosphatase using Human Intestinal Alkaline Phosphatase PubChem Bioassay (2010)[AID] 
Target
Name:
Intestinal-type alkaline phosphatase
Synonyms:
ALPI Intestinal alkaline phosphatase | PPBI_HUMAN
Type:
PROTEIN
Mol. Mass.:
56804.94
Organism:
Homo sapiens (Human)
Description:
ChEMBL_1278525
Residue:
528
  
Inhibitor
Name:
BDBM76197
Synonyms:
3-methoxy-4-oxidanyl-N-[(5E)-4-oxidanylidene-5-(2-oxidanylidene-1H-indol-3-ylidene)-2-sulfanylidene-1,3-thiazolidin-3-yl]benzamide 4-hydroxy-3-methoxy-N-[(5E)-4-oxo-5-(2-oxo-1H-indol-3-ylidene)-2-sulfanylidene-1,3-thiazolidin-3-yl]benzamide 4-hydroxy-N-[(5E)-4-keto-5-(2-ketoindolin-3-ylidene)-2-thioxo-thiazolidin-3-yl]-3-methoxy-benzamide SMR000413643 | cid_5543154
Type:
Small organic molecule
Emp. Form.:
C19H13N3O5S2
Mol. Mass.:
427.454
SMILES:
COc1cc(ccc1O)C(=O)NN1C(=S)S\C(C1=O)=C1\C(=O)Nc2ccccc12
: