Target
Intestinal-type alkaline phosphatase
Ligand
BDBM53127
Substrate
Meas. Tech.
Dose Response confirmation of uHTS inhibitors of Mouse Intestinal Alkaline Phosphatase using Human Intestinal Alkaline Phosphatase
IC50
>100000±n/a nM
Citation
 PubChem, PC Dose Response confirmation of uHTS inhibitors of Mouse Intestinal Alkaline Phosphatase using Human Intestinal Alkaline Phosphatase PubChem Bioassay (2010)[AID] 
Target
Name:
Intestinal-type alkaline phosphatase
Synonyms:
ALPI Intestinal alkaline phosphatase | PPBI_HUMAN
Type:
PROTEIN
Mol. Mass.:
56804.94
Organism:
Homo sapiens (Human)
Description:
ChEMBL_1278525
Residue:
528
  
Inhibitor
Name:
BDBM53127
Synonyms:
3-[3-(3-Furan-2-yl-acryloyl)-thioureido]-benzoic acid 3-[[(E)-3-(furan-2-yl)prop-2-enoyl]carbamothioylamino]benzoic acid MLS001211481 cid_845479
Type:
Small organic molecule
Emp. Form.:
C15H12N2O4S
Mol. Mass.:
316.332
SMILES:
OC(=O)c1cccc(NC(=S)NC(=O)C=Cc2ccco2)c1
: