Target
Intestinal-type alkaline phosphatase
Ligand
BDBM60915
Substrate
Meas. Tech.
Dose Response confirmation of uHTS inhibitors of Mouse Intestinal Alkaline Phosphatase using Human Intestinal Alkaline Phosphatase
IC50
12500±n/a nM
Citation
 PubChem, PC Dose Response confirmation of uHTS inhibitors of Mouse Intestinal Alkaline Phosphatase using Human Intestinal Alkaline Phosphatase PubChem Bioassay (2010)[AID] 
Target
Name:
Intestinal-type alkaline phosphatase
Synonyms:
ALPI Intestinal alkaline phosphatase | PPBI_HUMAN
Type:
PROTEIN
Mol. Mass.:
56804.94
Organism:
Homo sapiens (Human)
Description:
ChEMBL_1278525
Residue:
528
  
Inhibitor
Name:
BDBM60915
Synonyms:
(E)-2-cyano-3-(3,4-dihydroxyphenyl)-N-(5-quinolinyl)-2-propenamide (E)-2-cyano-3-(3,4-dihydroxyphenyl)-N-quinolin-5-ylprop-2-enamide MLS001173932 cid_9114427
Type:
Small organic molecule
Emp. Form.:
C19H13N3O3
Mol. Mass.:
331.3248
SMILES:
Oc1ccc(\C=C(/C#N)C(=O)Nc2cccc3ncccc23)cc1O
: