Target
Intestinal-type alkaline phosphatase
Ligand
BDBM76208
Substrate
Meas. Tech.
Dose Response confirmation of uHTS inhibitors of Mouse Intestinal Alkaline Phosphatase using Human Intestinal Alkaline Phosphatase
IC50
14300±n/a nM
Citation
 PubChem, PC Dose Response confirmation of uHTS inhibitors of Mouse Intestinal Alkaline Phosphatase using Human Intestinal Alkaline Phosphatase PubChem Bioassay (2010)[AID] 
Target
Name:
Intestinal-type alkaline phosphatase
Synonyms:
ALPI Intestinal alkaline phosphatase | PPBI_HUMAN
Type:
PROTEIN
Mol. Mass.:
56804.94
Organism:
Homo sapiens (Human)
Description:
ChEMBL_1278525
Residue:
528
  
Inhibitor
Name:
BDBM76208
Synonyms:
1-[(1-allyl-3-methyl-pyrazol-4-yl)methyl]-N-[3-(3-chlorophenyl)phenyl]isonipecotamide N-[3-(3-chlorophenyl)phenyl]-1-[(3-methyl-1-prop-2-enyl-4-pyrazolyl)methyl]-4-piperidinecarboxamide N-[3-(3-chlorophenyl)phenyl]-1-[(3-methyl-1-prop-2-enylpyrazol-4-yl)methyl]piperidine-4-carboxamide cid_24790205
Type:
Small organic molecule
Emp. Form.:
C26H29ClN4O
Mol. Mass.:
448.988
SMILES:
Cc1nn(CC=C)cc1CN1CCC(CC1)C(=O)Nc1cccc(c1)-c1cccc(Cl)c1
: