Target
Intestinal-type alkaline phosphatase
Ligand
BDBM76220
Substrate
Meas. Tech.
Dose Response confirmation of uHTS inhibitors of Mouse Intestinal Alkaline Phosphatase using Human Intestinal Alkaline Phosphatase
IC50
>100000±n/a nM
Citation
 PubChem, PC Dose Response confirmation of uHTS inhibitors of Mouse Intestinal Alkaline Phosphatase using Human Intestinal Alkaline Phosphatase PubChem Bioassay (2010)[AID] 
Target
Name:
Intestinal-type alkaline phosphatase
Synonyms:
ALPI Intestinal alkaline phosphatase | PPBI_HUMAN
Type:
PROTEIN
Mol. Mass.:
56804.94
Organism:
Homo sapiens (Human)
Description:
ChEMBL_1278525
Residue:
528
  
Inhibitor
Name:
BDBM76220
Synonyms:
4-(2-Oxo-2,3-dihydro-benzooxazole-6-sulfonylamino)-benzoic acid methyl ester 4-[(2-oxo-3H-1,3-benzoxazol-6-yl)sulfonylamino]benzoic acid methyl ester SMR000612785 methyl 4-[(2-oxidanylidene-3H-1,3-benzoxazol-6-yl)sulfonylamino]benzoate | methyl 4-[(2-oxo-3H-1,3-benzoxazol-6-yl)sulfonylamino]benzoate
Type:
Small organic molecule
Emp. Form.:
C15H12N2O6S
Mol. Mass.:
348.331
SMILES:
COC(=O)c1ccc(NS(=O)(=O)c2ccc3[nH]c(=O)oc3c2)cc1
: