Target
Intestinal-type alkaline phosphatase
Ligand
BDBM76236
Substrate
Meas. Tech.
Dose Response confirmation of uHTS inhibitors of Mouse Intestinal Alkaline Phosphatase using Human Intestinal Alkaline Phosphatase
IC50
>100000±n/a nM
Citation
 PubChem, PC Dose Response confirmation of uHTS inhibitors of Mouse Intestinal Alkaline Phosphatase using Human Intestinal Alkaline Phosphatase PubChem Bioassay (2010)[AID] 
Target
Name:
Intestinal-type alkaline phosphatase
Synonyms:
ALPI Intestinal alkaline phosphatase | PPBI_HUMAN
Type:
PROTEIN
Mol. Mass.:
56804.94
Organism:
Homo sapiens (Human)
Description:
ChEMBL_1278525
Residue:
528
  
Inhibitor
Name:
BDBM76236
Synonyms:
MLS002153600 TG-IK | cid_24978567
Type:
Small organic molecule
Emp. Form.:
C62H107N17O8
Mol. Mass.:
1218.6221
SMILES:
CC[C@H](C)Cc1cn(nn1)[C@@H](CCCCN)C(=O)NCCCCCCCCCCC(=O)N1CCN(CC1)c1nc(NCCOCCOCCOCC#C)nc(n1)N1CCN(CC1)C(=O)CCCCCCCCCCNC(=O)Cn1cc(C[C@@H](C)O)nn1
: