Target
Intestinal-type alkaline phosphatase
Ligand
BDBM76242
Substrate
Meas. Tech.
Dose Response confirmation of uHTS inhibitors of Mouse Intestinal Alkaline Phosphatase using Human Intestinal Alkaline Phosphatase
IC50
>100000±n/a nM
Citation
 PubChem, PC Dose Response confirmation of uHTS inhibitors of Mouse Intestinal Alkaline Phosphatase using Human Intestinal Alkaline Phosphatase PubChem Bioassay (2010)[AID] 
Target
Name:
Intestinal-type alkaline phosphatase
Synonyms:
ALPI Intestinal alkaline phosphatase | PPBI_HUMAN
Type:
PROTEIN
Mol. Mass.:
56804.94
Organism:
Homo sapiens (Human)
Description:
ChEMBL_1278525
Residue:
528
  
Inhibitor
Name:
BDBM76242
Synonyms:
2-phenoxyacetic acid [2-[(5-nitro-2-thiazolyl)amino]-2-oxoethyl] ester MLS002171146 [2-[(5-nitro-1,3-thiazol-2-yl)amino]-2-oxidanylidene-ethyl] 2-phenoxyethanoate cid_4274507
Type:
Small organic molecule
Emp. Form.:
C13H11N3O6S
Mol. Mass.:
337.308
SMILES:
[O-][N+](=O)c1cnc(NC(=O)COC(=O)COc2ccccc2)s1
: