Target
Intestinal-type alkaline phosphatase
Ligand
BDBM76243
Substrate
Meas. Tech.
Dose Response confirmation of uHTS inhibitors of Mouse Intestinal Alkaline Phosphatase using Human Intestinal Alkaline Phosphatase
IC50
>100000±n/a nM
Citation
 PubChem, PC Dose Response confirmation of uHTS inhibitors of Mouse Intestinal Alkaline Phosphatase using Human Intestinal Alkaline Phosphatase PubChem Bioassay (2010)[AID] 
Target
Name:
Intestinal-type alkaline phosphatase
Synonyms:
ALPI Intestinal alkaline phosphatase | PPBI_HUMAN
Type:
PROTEIN
Mol. Mass.:
56804.94
Organism:
Homo sapiens (Human)
Description:
ChEMBL_1278525
Residue:
528
  
Inhibitor
Name:
BDBM76243
Synonyms:
1-(4-methylphenyl)sulfonyl-N-(4-propan-2-ylphenyl)-4-piperidinecarboxamide MLS002162172 SMR001244582 | cid_4786721
Type:
Small organic molecule
Emp. Form.:
C22H28N2O3S
Mol. Mass.:
400.534
SMILES:
CC(C)c1ccc(NC(=O)C2CCN(CC2)S(=O)(=O)c2ccc(C)cc2)cc1
: