Target
Alkaline phosphatase, germ cell type
Ligand
BDBM65301
Substrate
Meas. Tech.
Dose Response confirmation of uHTS activators of Mouse Intestinal Alkaline Phosphatase using Placental Alkaline Phosphatase
EC50
69300±n/a nM
Citation
 PubChem, PC Dose Response confirmation of uHTS activators of Mouse Intestinal Alkaline Phosphatase using Placental Alkaline Phosphatase PubChem Bioassay (2010)[AID] 
Target
Name:
Alkaline phosphatase, germ cell type
Synonyms:
ALPG ALPPL2 PPBN_HUMAN | placental-like alkaline phosphatase preproprotein
Type:
PROTEIN
Mol. Mass.:
57374.31
Organism:
Homo sapiens (Human)
Description:
ChEMBL_29964
Residue:
532
  
Inhibitor
Name:
BDBM65301
Synonyms:
3,4,5-trihydroxybenzohydrazide MLS000713290 cid_592744
Type:
Small organic molecule
Emp. Form.:
C7H8N2O4
Mol. Mass.:
184.1494
SMILES:
NNC(=O)c1cc(O)c(O)c(O)c1
: