Target
Alkaline phosphatase, germ cell type
Ligand
BDBM76228
Substrate
Meas. Tech.
Dose Response confirmation of uHTS activators of Mouse Intestinal Alkaline Phosphatase using Placental Alkaline Phosphatase
EC50
>100000±n/a nM
Citation
 PubChem, PC Dose Response confirmation of uHTS activators of Mouse Intestinal Alkaline Phosphatase using Placental Alkaline Phosphatase PubChem Bioassay (2010)[AID] 
Target
Name:
Alkaline phosphatase, germ cell type
Synonyms:
ALPG ALPPL2 PPBN_HUMAN | placental-like alkaline phosphatase preproprotein
Type:
PROTEIN
Mol. Mass.:
57374.31
Organism:
Homo sapiens (Human)
Description:
ChEMBL_29964
Residue:
532
  
Inhibitor
Name:
BDBM76228
Synonyms:
1-(3,4-dihydro-2H-1-benzothiopyran-4-yl)-3-(phenylmethyl)thiourea 1-benzyl-3-(3,4-dihydro-2H-thiochromen-4-yl)thiourea MLS001143039 cid_24684580
Type:
Small organic molecule
Emp. Form.:
C17H18N2S2
Mol. Mass.:
314.468
SMILES:
S=C(NCc1ccccc1)NC1CCSc2ccccc12
: