Target
Alkaline phosphatase, germ cell type
Ligand
BDBM76165
Substrate
Meas. Tech.
Dose Response confirmation of uHTS activators of Mouse Intestinal Alkaline Phosphatase using Placental Alkaline Phosphatase
EC50
26000±n/a nM
Citation
 PubChem, PC Dose Response confirmation of uHTS activators of Mouse Intestinal Alkaline Phosphatase using Placental Alkaline Phosphatase PubChem Bioassay (2010)[AID] 
Target
Name:
Alkaline phosphatase, germ cell type
Synonyms:
ALPG ALPPL2 PPBN_HUMAN | placental-like alkaline phosphatase preproprotein
Type:
PROTEIN
Mol. Mass.:
57374.31
Organism:
Homo sapiens (Human)
Description:
ChEMBL_29964
Residue:
532
  
Inhibitor
Name:
BDBM76165
Synonyms:
2-[[2-[2-[[4-[2-hydroxyethyl(methyl)amino]phenyl]methylidene]hydrazinyl]-5-nitro-phenyl]sulfonylamino]benzoic acid 2-[[2-[N'-[4-[2-hydroxyethyl(methyl)amino]benzylidene]hydrazino]-5-nitro-phenyl]sulfonylamino]benzoic acid SMR001314654 | cid_5131597
Type:
Small organic molecule
Emp. Form.:
C23H23N5O7S
Mol. Mass.:
513.523
SMILES:
CN(CCO)c1ccc(CN=Nc2ccc(cc2S(=O)(=O)Nc2ccccc2C(O)=O)[N+]([O-])=O)cc1
: