Target
Alkaline phosphatase, germ cell type
Ligand
BDBM40728
Substrate
Meas. Tech.
Dose Response confirmation of uHTS inhibitors of Mouse Intestinal Alkaline Phosphatase using Placental Alkaline Phosphatase
IC50
>100000±n/a nM
Citation
 PubChem, PC Dose Response confirmation of uHTS inhibitors of Mouse Intestinal Alkaline Phosphatase using Placental Alkaline Phosphatase PubChem Bioassay (2010)[AID] 
Target
Name:
Alkaline phosphatase, germ cell type
Synonyms:
ALPG ALPPL2 PPBN_HUMAN | placental-like alkaline phosphatase preproprotein
Type:
PROTEIN
Mol. Mass.:
57374.31
Organism:
Homo sapiens (Human)
Description:
ChEMBL_29964
Residue:
532
  
Inhibitor
Name:
BDBM40728
Synonyms:
2-[2-oxidanylidene-2-[2-[(Z)-(3-oxidanyl-4-oxidanylidene-cyclohexa-2,5-dien-1-ylidene)methyl]hydrazinyl]ethoxy]-N''-[(Z)-(3-oxidanyl-4-oxidanylidene-cyclohexa-2,5-dien-1-ylidene)methyl]benzohydrazide N'-(3,4-dihydroxybenzylidene)-2-{2-[2-(3,4-dihydroxybenzylidene)hydrazino]-2-oxoethoxy}benzohydrazide N''-[(Z)-(3-hydroxy-4-oxo-1-cyclohexa-2,5-dienylidene)methyl]-2-[2-[[(Z)-(3-hydroxy-4-oxo-1-cyclohexa-2,5-dienylidene)methyl]hydrazo]-2-oxoethoxy]benzohydrazide N'-[(Z)-(3-hydroxy-4-keto-cyclohexa-2,5-dien-1-ylidene)methyl]-2-[2-[N'-[(E)-(3-hydroxy-4-keto-cyclohexa-2,5-dien-1-ylidene)methyl]hydrazino]-2-keto-ethoxy]benzohydrazide SMR000161891 | cid_11958779
Type:
Small organic molecule
Emp. Form.:
C23H20N4O7
Mol. Mass.:
464.4275
SMILES:
Oc1ccc(C=NNC(=O)COc2ccccc2C(=O)NN=Cc2ccc(O)c(O)c2)cc1O
: