Target
Alkaline phosphatase, germ cell type
Ligand
BDBM57462
Substrate
Meas. Tech.
Dose Response confirmation of uHTS inhibitors of Mouse Intestinal Alkaline Phosphatase using Placental Alkaline Phosphatase
IC50
72700±n/a nM
Citation
 PubChem, PC Dose Response confirmation of uHTS inhibitors of Mouse Intestinal Alkaline Phosphatase using Placental Alkaline Phosphatase PubChem Bioassay (2010)[AID] 
Target
Name:
Alkaline phosphatase, germ cell type
Synonyms:
ALPG ALPPL2 PPBN_HUMAN | placental-like alkaline phosphatase preproprotein
Type:
PROTEIN
Mol. Mass.:
57374.31
Organism:
Homo sapiens (Human)
Description:
ChEMBL_29964
Residue:
532
  
Inhibitor
Name:
BDBM57462
Synonyms:
1-(3-chlorophenyl)-3-(3,3-diphenylpropyl)thiourea N-(3-chlorophenyl)-N'-(3,3-diphenylpropyl)thiourea cid_1336020
Type:
Small organic molecule
Emp. Form.:
C22H21ClN2S
Mol. Mass.:
380.934
SMILES:
Clc1cccc(NC(=S)NCCC(c2ccccc2)c2ccccc2)c1
: