Target
Alkaline phosphatase, germ cell type
Ligand
BDBM59294
Substrate
Meas. Tech.
Dose Response confirmation of uHTS inhibitors of Mouse Intestinal Alkaline Phosphatase using Placental Alkaline Phosphatase
IC50
>100000±n/a nM
Citation
 PubChem, PC Dose Response confirmation of uHTS inhibitors of Mouse Intestinal Alkaline Phosphatase using Placental Alkaline Phosphatase PubChem Bioassay (2010)[AID] 
Target
Name:
Alkaline phosphatase, germ cell type
Synonyms:
ALPG ALPPL2 PPBN_HUMAN | placental-like alkaline phosphatase preproprotein
Type:
PROTEIN
Mol. Mass.:
57374.31
Organism:
Homo sapiens (Human)
Description:
ChEMBL_29964
Residue:
532
  
Inhibitor
Name:
BDBM59294
Synonyms:
4-[4-(2-fluorophenyl)-1-piperazinyl]-3-[[(3-methoxyanilino)-oxomethyl]amino]benzoic acid ethyl ester MLS000584002 cid_12004863 ethyl 4-[4-(2-fluorophenyl)piperazin-1-yl]-3-[(3-methoxyphenyl)carbamoylamino]benzoate
Type:
Small organic molecule
Emp. Form.:
C27H29FN4O4
Mol. Mass.:
492.542
SMILES:
CCOC(=O)c1ccc(N2CCN(CC2)c2ccccc2F)c(NC(=O)Nc2cccc(OC)c2)c1
: