Target
Alkaline phosphatase, germ cell type
Ligand
BDBM76188
Substrate
Meas. Tech.
Dose Response confirmation of uHTS inhibitors of Mouse Intestinal Alkaline Phosphatase using Placental Alkaline Phosphatase
IC50
>100000±n/a nM
Citation
 PubChem, PC Dose Response confirmation of uHTS inhibitors of Mouse Intestinal Alkaline Phosphatase using Placental Alkaline Phosphatase PubChem Bioassay (2010)[AID] 
Target
Name:
Alkaline phosphatase, germ cell type
Synonyms:
ALPG ALPPL2 PPBN_HUMAN | placental-like alkaline phosphatase preproprotein
Type:
PROTEIN
Mol. Mass.:
57374.31
Organism:
Homo sapiens (Human)
Description:
ChEMBL_29964
Residue:
532
  
Inhibitor
Name:
BDBM76188
Synonyms:
1-methyl-5-methylsulfonyl-3-nitro-1,2,4-triazole MLS000678365 cid_3148843
Type:
Small organic molecule
Emp. Form.:
C4H6N4O4S
Mol. Mass.:
206.18
SMILES:
Cn1nc(nc1S(C)(=O)=O)[N+]([O-])=O
: